[vserver] Testing patch 3.0.9-vs2.3.2

From: Sebastian Steinhuber <sebastian.steinhuber_at_googlemail.com>
Date: Thu 17 Nov 2011 - 13:24:19 GMT
Message-ID: <4EC50B03.4070002@gmail.com>

I committed patch-3.0.9-vs2.3.2 to vanilla kernel. The sublevel changed
form 9 to 7 afterwards because of line 167: +SUBLEVEL = 7

Btw, similar issue with patch-3.1.1-vs2.3.2 leading to a 3.1.11-vs2.3.2
line 167: +EXTRAVERSION = 1-vs2.3.2

But the compilation of 3.0.9-vs2.3.2 stopped with errors. The full
output of 'make all' is appended to the message.

include/linux/vserver/limit_int.h: In function ‘__vx_acc_cres’:
include/linux/vserver/limit_int.h:16:1: error: ‘vs_debug_cres’
undeclared (first use in this function)
include/linux/vserver/limit_int.h:16:1: note: each undeclared identifier
is reported only once for each function it appears in
include/linux/vserver/limit_int.h: In function ‘__vx_add_cres’:
include/linux/vserver/limit_int.h:33:1: error: ‘vs_debug_cres’
undeclared (first use in this function)
include/linux/vserver/limit_int.h: In function ‘__vx_cres_avail’:
include/linux/vserver/limit_int.h:84:1: error: ‘vs_debug_limit’
undeclared (first use in this function)
make[2]: *** [arch/x86/mm/init.o] Fehler 1
make[1]: *** [arch/x86/mm] Fehler 2
make: *** [arch/x86] Fehler 2

I'm guessing that there might be a bug. I'm on x86-64, debian/unstable
with patches from http://vserver.13thfloor.at/Experimental/. Any hints?
Thanks in advance.

Best regards,

Received on Thu Nov 17 13:24:40 2011
[Next/Previous Months] [Main vserver Project Homepage] [Howto Subscribe/Unsubscribe] [Paul Sladen's vserver stuff]
Generated on Thu 17 Nov 2011 - 13:24:40 GMT by hypermail 2.1.8